Target
Sphingosine 1-phosphate receptor 4
Ligand
BDBM50063864
Substrate
Meas. Tech.
ChEMBL_1463805 (CHEMBL3404968)
EC50
26±n/a nM
Citation
 Buzard, DJSchrader, TOZhu, XLehmann, JJohnson, BKasem, MKim, SHKawasaki, ALopez, LMoody, JHan, SGao, YEdwards, JBarden, JThatte, JGatlin, JJones, RM Design and synthesis of new tricyclic indoles as potent modulators of the S1P1 receptor. Bioorg Med Chem Lett 25:659-63 (2015)  
Target
Name:
Sphingosine 1-phosphate receptor 4
Synonyms:
EDG6 S1P receptor 4 S1P4 S1PR4_HUMAN Sphingosine 1-phosphate receptor Edg-6 sphingosine-1-phosphate 4 S1P4
Type:
G Protein-Coupled Receptor (GPCR)
Mol. Mass.:
41647.39
Organism:
Homo sapiens (Human)
Description:
Residue:
384
  
Inhibitor
Name:
BDBM50063864
Synonyms:
CHEMBL3403619 | US10676467, Compound TZ 50 13
Type:
Small organic molecule
Emp. Form.:
C26H27F3N2O3
Mol. Mass.:
472.4994
SMILES:
OC(=O)CC1NCCc2c1[nH]c1ccc(OCc3ccc(C4CCCC4)c(c3)C(F)(F)F)cc21
: