Target
Sphingosine 1-phosphate receptor 5
Ligand
BDBM50063864
Substrate
Meas. Tech.
ChEMBL_1463807 (CHEMBL3404970)
EC50
5.8±n/a nM
Citation
 Buzard, DJSchrader, TOZhu, XLehmann, JJohnson, BKasem, MKim, SHKawasaki, ALopez, LMoody, JHan, SGao, YEdwards, JBarden, JThatte, JGatlin, JJones, RM Design and synthesis of new tricyclic indoles as potent modulators of the S1P1 receptor. Bioorg Med Chem Lett 25:659-63 (2015)  
Target
Name:
Sphingosine 1-phosphate receptor 5
Synonyms:
EDG8 S1P5 S1PR5_HUMAN Sphingosine 1-phosphate receptor Edg-8
Type:
G Protein-Coupled Receptor (GPCR)
Mol. Mass.:
41796.42
Organism:
Homo sapiens (Human)
Description:
Residue:
398
  
Inhibitor
Name:
BDBM50063864
Synonyms:
CHEMBL3403619 | US10676467, Compound TZ 50 13
Type:
Small organic molecule
Emp. Form.:
C26H27F3N2O3
Mol. Mass.:
472.4994
SMILES:
OC(=O)CC1NCCc2c1[nH]c1ccc(OCc3ccc(C4CCCC4)c(c3)C(F)(F)F)cc21
: