Target
Metabotropic glutamate receptor 6
Ligand
BDBM50064463
Substrate
Meas. Tech.
ChEMBL_1464933 (CHEMBL3404403)
EC50
>10000±n/a nM
Citation
 Martín-Martín, MLBartolomé-Nebreda, JMConde-Ceide, SAlonso de Diego, SALópez, SMartínez-Viturro, CMTong, HMLavreysen, HMacdonald, GJSteckler, TMackie, CBridges, TMDaniels, JSNiswender, CMNoetzel, MJJones, CKConn, PJLindsley, CWStauffer, SR Discovery and SAR of novel series of imidazopyrimidinones and dihydroimidazopyrimidinones as positive allosteric modulators of the metabotropic glutamate receptor 5 (mGlu5). Bioorg Med Chem Lett 25:1310-7 (2015)  
Target
Name:
Metabotropic glutamate receptor 6
Synonyms:
GPRC1F GRM6_HUMAN Metabotropic glutamate receptor 6 metabotropic glutamate 6
Type:
Enzyme Catalytic Domain
Mol. Mass.:
95479.26
Organism:
Homo sapiens (Human)
Description:
metabotropic glutamate 6 GRM6 HUMAN::O15303
Residue:
877
  
Inhibitor
Name:
BDBM50064463
Synonyms:
CHEMBL3401177
Type:
Small organic molecule
Emp. Form.:
C19H14FN3O2
Mol. Mass.:
335.3318
SMILES:
Fc1ccc(cc1)-n1ccc2nc(COc3ccccc3)cn2c1=O
: