Target
Metabotropic glutamate receptor 7
Ligand
BDBM50064463
Substrate
Meas. Tech.
ChEMBL_1464934 (CHEMBL3404404)
EC50
>10000±n/a nM
Citation
 Martín-Martín, MLBartolomé-Nebreda, JMConde-Ceide, SAlonso de Diego, SALópez, SMartínez-Viturro, CMTong, HMLavreysen, HMacdonald, GJSteckler, TMackie, CBridges, TMDaniels, JSNiswender, CMNoetzel, MJJones, CKConn, PJLindsley, CWStauffer, SR Discovery and SAR of novel series of imidazopyrimidinones and dihydroimidazopyrimidinones as positive allosteric modulators of the metabotropic glutamate receptor 5 (mGlu5). Bioorg Med Chem Lett 25:1310-7 (2015)  
Target
Name:
Metabotropic glutamate receptor 7
Synonyms:
GPRC1G GRM7 protein MGLUR7 metabotropic glutamate 7
Type:
Enzyme Catalytic Domain
Mol. Mass.:
102262.98
Organism:
Homo sapiens (Human)
Description:
Q14831
Residue:
915
  
Inhibitor
Name:
BDBM50064463
Synonyms:
CHEMBL3401177
Type:
Small organic molecule
Emp. Form.:
C19H14FN3O2
Mol. Mass.:
335.3318
SMILES:
Fc1ccc(cc1)-n1ccc2nc(COc3ccccc3)cn2c1=O
: