Target
Adenosine receptor A2a
Ligand
BDBM50064623
Substrate
Meas. Tech.
ChEMBL_1465025 (CHEMBL3405041)
Ki
>30000±n/a nM
Citation
 Pandya, DHSharma, JAJalani, HBPandya, ANSudarsanam, VKachler, SKlotz, KNVasu, KK Novel thiazole-thiophene conjugates as adenosine receptor antagonists: synthesis, biological evaluation and docking studies. Bioorg Med Chem Lett 25:1306-9 (2015)  
Target
Name:
Adenosine receptor A2a
Synonyms:
A2A adenosine receptor (hA2A) ADENOSINE A2 ADORA2 Adenosine A2A receptor (A2AAR)
Type:
G Protein-Coupled Receptor (GPCR)
Mol. Mass.:
44716.46
Organism:
Homo sapiens (Human)
Description:
P29274
Residue:
412
  
Inhibitor
Name:
BDBM50064623
Synonyms:
CHEMBL3403731
Type:
Small organic molecule
Emp. Form.:
C21H21N5OS2
Mol. Mass.:
423.554
SMILES:
CN(C)c1nc(Nc2ccccc2)sc1C(=O)Nc1sc2CCCCc2c1C#N
: