Target
Adenosine receptor A2a
Ligand
BDBM50064628
Substrate
Meas. Tech.
ChEMBL_1465025 (CHEMBL3405041)
Ki
>30000±n/a nM
Citation
 Pandya, DHSharma, JAJalani, HBPandya, ANSudarsanam, VKachler, SKlotz, KNVasu, KK Novel thiazole-thiophene conjugates as adenosine receptor antagonists: synthesis, biological evaluation and docking studies. Bioorg Med Chem Lett 25:1306-9 (2015)  
Target
Name:
Adenosine receptor A2a
Synonyms:
A2A adenosine receptor (hA2A) ADENOSINE A2 ADORA2 Adenosine A2A receptor (A2AAR)
Type:
G Protein-Coupled Receptor (GPCR)
Mol. Mass.:
44716.46
Organism:
Homo sapiens (Human)
Description:
P29274
Residue:
412
  
Inhibitor
Name:
BDBM50064628
Synonyms:
CHEMBL3403736
Type:
Small organic molecule
Emp. Form.:
C27H24N4O2S2
Mol. Mass.:
500.635
SMILES:
COc1ccc(Nc2nc(c(s2)C(=O)Nc2sc3CCCCc3c2C#N)-c2ccc(C)cc2)cc1
: