Target
Adenosine receptor A3
Ligand
BDBM50064632
Substrate
Meas. Tech.
ChEMBL_1465026 (CHEMBL3405042)
Ki
>30000±n/a nM
Citation
 Pandya, DHSharma, JAJalani, HBPandya, ANSudarsanam, VKachler, SKlotz, KNVasu, KK Novel thiazole-thiophene conjugates as adenosine receptor antagonists: synthesis, biological evaluation and docking studies. Bioorg Med Chem Lett 25:1306-9 (2015)  
Target
Name:
Adenosine receptor A3
Synonyms:
A3 adenosine receptor (hA3) ADORA3 | Adenosine A3 receptor (A3AR)
Type:
G Protein-Coupled Receptor (GPCR)
Mol. Mass.:
36197.32
Organism:
Homo sapiens (Human)
Description:
P0DMS8
Residue:
318
  
Inhibitor
Name:
BDBM50064632
Synonyms:
CHEMBL3403740
Type:
Small organic molecule
Emp. Form.:
C22H23N3O5S2
Mol. Mass.:
473.565
SMILES:
CCOC(=O)c1c(C)c(sc1NC(=O)c1sc(Nc2ccc(C)cc2)nc1C)C(=O)OC
: