Target
Adenosine receptor A1
Ligand
BDBM50064630
Substrate
Meas. Tech.
ChEMBL_1465024 (CHEMBL3405040)
Ki
>30000±n/a nM
Citation
 Pandya, DHSharma, JAJalani, HBPandya, ANSudarsanam, VKachler, SKlotz, KNVasu, KK Novel thiazole-thiophene conjugates as adenosine receptor antagonists: synthesis, biological evaluation and docking studies. Bioorg Med Chem Lett 25:1306-9 (2015)  
Target
Name:
Adenosine receptor A1
Synonyms:
A1 adenosine receptor (hA1) AA1R_HUMAN ADORA1 Adenosine A1-receptor Adenosine receptor A1 (hA1) | Adenosine transporter (AdT)
Type:
G Protein-Coupled Receptor (GPCR)
Mol. Mass.:
36520.92
Organism:
Homo sapiens (Human)
Description:
P30542
Residue:
326
  
Inhibitor
Name:
BDBM50064630
Synonyms:
CHEMBL3403738
Type:
Small organic molecule
Emp. Form.:
C21H20N4OS2
Mol. Mass.:
408.54
SMILES:
Cc1nc(Nc2ccc(C)cc2)sc1C(=O)Nc1sc2CCCCc2c1C#N
: