Target
Probable G-protein coupled receptor 88
Ligand
BDBM50064650
Substrate
Meas. Tech.
ChEMBL_1465054 (CHEMBL3405070)
EC50
730±n/a nM
Citation
 Dzierba, CDBi, YDasgupta, BHartz, RAAhuja, VCianchetta, GKumi, GDong, LAleem, SFink, CGarcia, YGreen, MHan, JKwon, SQiao, YWang, JZhang, YLiu, YZipp, GLiang, ZBurford, NFerrante, MBertekap, RLewis, MCacace, AGrace, JWilson, ANouraldeen, AWestphal, RKimball, DCarson, KBronson, JJMacor, JE Design, synthesis, and evaluation of phenylglycinols and phenyl amines as agonists of GPR88. Bioorg Med Chem Lett 25:1448-52 (2015)  
Target
Name:
Probable G-protein coupled receptor 88
Synonyms:
GPR88 Probable G-protein coupled receptor 88 Striatum-specific G-protein coupled receptor
Type:
PROTEIN
Mol. Mass.:
40264.74
Organism:
Homo sapiens (Human)
Description:
ChEMBL_109566
Residue:
384
  
Inhibitor
Name:
BDBM50064650
Synonyms:
CHEMBL3403773
Type:
Small organic molecule
Emp. Form.:
C24H31NO3
Mol. Mass.:
381.5078
SMILES:
CCCC(C)COc1ccc(cc1)[C@H](CO)NC(=O)[C@H]1C[C@@H]1c1ccccc1
: