Target
5-hydroxytryptamine receptor 2B
Ligand
BDBM50065018
Substrate
Meas. Tech.
ChEMBL_1465387 (CHEMBL3406943)
Ki
8.0±n/a nM
Citation
 Sakhuja, RKondabolu, KCórdova-Sintjago, TTravers, SVincek, ASKim, MSAbboud, KAFang, LSun, ZCanal, CEBooth, RG Novel 4-substituted-N,N-dimethyltetrahydronaphthalen-2-amines: synthesis, affinity, and in silico docking studies at serotonin 5-HT2-type and histamine H1 G protein-coupled receptors. Bioorg Med Chem 23:1588-600 (2015)  
Target
Name:
5-hydroxytryptamine receptor 2B
Synonyms:
5-HT-2B 5-hydroxytryptamine (serotonin) receptor 2B [Homo sapiens] 5-hydroxytryptamine receptor 2C (5HT2C) HTR2B Serotonin 2b (5-HT2b) receptor | Serotonin Receptor 2B
Type:
G Protein-Coupled Receptor (GPCR)
Mol. Mass.:
54312.47
Organism:
Homo sapiens (Human)
Description:
Receptor binding assays were performed using human clone stably expressed in CHO cells.
Residue:
481
  
Inhibitor
Name:
BDBM50065018
Synonyms:
CHEMBL3402673
Type:
Small organic molecule
Emp. Form.:
C18H21BrClN
Mol. Mass.:
366.723
SMILES:
Cl.CN(C)[C@H]1C[C@H](c2cccc(Br)c2)c2ccccc2C1
: