Target
Histamine H3 receptor
Ligand
BDBM50065016
Substrate
Meas. Tech.
ChEMBL_1465389 (CHEMBL3406945)
Ki
10.0±n/a nM
Citation
 Sakhuja, RKondabolu, KCórdova-Sintjago, TTravers, SVincek, ASKim, MSAbboud, KAFang, LSun, ZCanal, CEBooth, RG Novel 4-substituted-N,N-dimethyltetrahydronaphthalen-2-amines: synthesis, affinity, and in silico docking studies at serotonin 5-HT2-type and histamine H1 G protein-coupled receptors. Bioorg Med Chem 23:1588-600 (2015)  
Target
Name:
Histamine H3 receptor
Synonyms:
G-protein coupled receptor 97 HH3R HRH3 Histamine H3 receptor (H3) Histamine receptor (H3 and H4)
Type:
G Protein-Coupled Receptor (GPCR)
Mol. Mass.:
48691.47
Organism:
Homo sapiens (Human)
Description:
Binding assays were using CHO cells stably expressing hH3R receptors.
Residue:
445
  
Inhibitor
Name:
BDBM50065016
Synonyms:
CHEMBL3402675
Type:
Small organic molecule
Emp. Form.:
C18H21Cl2N
Mol. Mass.:
322.272
SMILES:
Cl.CN(C)[C@H]1C[C@H](c2cccc(Cl)c2)c2ccccc2C1
: