Target
Renin
Ligand
BDBM50065428
Substrate
Meas. Tech.
ChEMBL_1465911 (CHEMBL3406559)
Ki
0.600000±n/a nM
Citation
 McKittrick, BACaldwell, JPBara, TBoykow, GChintala, MClader, JCzarniecki, MCourneya, BDuffy, RFleming, LGiessert, RGreenlee, WJHeap, CHong, LHuang, YIserloh, UJosien, HKhan, TKorfmacher, WLiang, XMazzola, RMitra, SMoore, KOrth, PRajagopalan, MRoy, SSakwa, SStrickland, CVaccaro, HVoigt, JWang, HWong, JZhang, RZych, A Iminopyrimidinones: a novel pharmacophore for the development of orally active renin inhibitors. Bioorg Med Chem Lett 25:1592-6 (2015)  
Target
Name:
Renin
Synonyms:
Angiotensinogenase RENI_HUMAN
Type:
Enzyme
Mol. Mass.:
45058.99
Organism:
Homo sapiens (Human)
Description:
Residue:
406
  
Inhibitor
Name:
BDBM50065428
Synonyms:
CHEMBL3401350
Type:
Small organic molecule
Emp. Form.:
C24H29FN4O2
Mol. Mass.:
424.5111
SMILES:
CC(C)[C@]1(C)CC(=O)N(Cc2cc(F)cc(c2)C(=O)N[C@@H](C)c2ccccc2)C(=N)N1
: