Target
Sphingosine 1-phosphate receptor 2
Ligand
BDBM50065604
Substrate
Meas. Tech.
ChEMBL_1463948 (CHEMBL3405600)
IC50
860±n/a nM
Citation
 Kusumi, KShinozaki, KKanaji, TKurata, HNaganawa, AOtsuki, KMatsushita, TSekiguchi, TKakuuchi, ASeko, T Discovery of novel S1P2 antagonists. Part 1: discovery of 1,3-bis(aryloxy)benzene derivatives. Bioorg Med Chem Lett 25:1479-82 (2015)  
Target
Name:
Sphingosine 1-phosphate receptor 2
Synonyms:
EDG5 S1PR2 Sphingosine 1-phosphate receptor Sphingosine-1-phosphate receptor 2 | ndothelial differentiation G-protein coupled receptor 5
Type:
G Protein-Coupled Receptor (GPCR)
Mol. Mass.:
38883.16
Organism:
Homo sapiens (Human)
Description:
Membranes isolated from S1P2-transfected CHO cells were used in ligand binding assay.
Residue:
353
  
Inhibitor
Name:
BDBM50065604
Synonyms:
CHEMBL3401377
Type:
Small organic molecule
Emp. Form.:
C24H30ClFN2O3
Mol. Mass.:
448.958
SMILES:
CCC(CC)CC1(O)CCN(CC1)C(=O)Nc1cc(Cl)cc(Oc2ccc(F)cc2)c1
: