Target
Sphingosine 1-phosphate receptor 2
Ligand
BDBM50065628
Substrate
Meas. Tech.
ChEMBL_1463947 (CHEMBL3405599)
IC50
10.0±n/a nM
Citation
 Kusumi, KShinozaki, KKanaji, TKurata, HNaganawa, AOtsuki, KMatsushita, TSekiguchi, TKakuuchi, ASeko, T Discovery of novel S1P2 antagonists. Part 1: discovery of 1,3-bis(aryloxy)benzene derivatives. Bioorg Med Chem Lett 25:1479-82 (2015)  
Target
Name:
Sphingosine 1-phosphate receptor 2
Synonyms:
EDG5 S1PR2 Sphingosine 1-phosphate receptor Sphingosine-1-phosphate receptor 2 | ndothelial differentiation G-protein coupled receptor 5
Type:
G Protein-Coupled Receptor (GPCR)
Mol. Mass.:
38883.16
Organism:
Homo sapiens (Human)
Description:
Membranes isolated from S1P2-transfected CHO cells were used in ligand binding assay.
Residue:
353
  
Inhibitor
Name:
BDBM50065628
Synonyms:
CHEMBL1368758 | US9663511, Compound JTE013
Type:
Small organic molecule
Emp. Form.:
C17H19Cl2N7O
Mol. Mass.:
408.285
SMILES:
CC(C)c1cc(NNC(=O)Nc2cc(Cl)nc(Cl)c2)nc2n(C)nc(C)c12
: