Target
Sphingosine 1-phosphate receptor 3
Ligand
BDBM50065618
Substrate
Meas. Tech.
ChEMBL_1463950 (CHEMBL3405602)
IC50
>25000±n/a nM
Citation
 Kusumi, KShinozaki, KKanaji, TKurata, HNaganawa, AOtsuki, KMatsushita, TSekiguchi, TKakuuchi, ASeko, T Discovery of novel S1P2 antagonists. Part 1: discovery of 1,3-bis(aryloxy)benzene derivatives. Bioorg Med Chem Lett 25:1479-82 (2015)  
Target
Name:
Sphingosine 1-phosphate receptor 3
Synonyms:
C9orf108 EDG3 S1P receptor 3 S1P3 S1PR3_HUMAN Sphingosine 1-phosphate receptor 3 (S1P3) | Sphingosine 1-phosphate receptor Edg-3
Type:
G Protein-Coupled Receptor (GPCR)
Mol. Mass.:
42278.13
Organism:
Homo sapiens (Human)
Description:
Q99500
Residue:
378
  
Inhibitor
Name:
BDBM50065618
Synonyms:
CHEMBL3401390
Type:
Small organic molecule
Emp. Form.:
C29H34FN3O4
Mol. Mass.:
507.5964
SMILES:
CCC(CC)CC1(O)CCN(CC1)C(=O)Nc1cc(Oc2ccc(F)cc2)cc(Oc2ccccn2)c1
: