Target
Metabotropic glutamate receptor 5
Ligand
BDBM50067184
Substrate
Meas. Tech.
ChEMBL_1463958 (CHEMBL3405792)
IC50
42000±n/a nM
Citation
 He, XLakkaraju, SKHanscom, MZhao, ZWu, JStoica, BMacKerell, ADFaden, AIXue, F Acyl-2-aminobenzimidazoles: a novel class of neuroprotective agents targeting mGluR5. Bioorg Med Chem 23:2211-20 (2015)  
Target
Name:
Metabotropic glutamate receptor 5
Synonyms:
GRM5_MOUSE Grm5 | Mglur5
Type:
PROTEIN
Mol. Mass.:
131881.16
Organism:
Mus musculus
Description:
ChEMBL_103834
Residue:
1203
  
Inhibitor
Name:
BDBM50067184
Synonyms:
CHEMBL3401729
Type:
Small organic molecule
Emp. Form.:
C14H17N3O
Mol. Mass.:
243.3043
SMILES:
O=C(Nc1nc2ccccc2[nH]1)C1CCCCC1
: