Target
Metabotropic glutamate receptor 5
Ligand
BDBM50067179
Substrate
Meas. Tech.
ChEMBL_1463958 (CHEMBL3405792)
IC50
34000±n/a nM
Citation
 He, XLakkaraju, SKHanscom, MZhao, ZWu, JStoica, BMacKerell, ADFaden, AIXue, F Acyl-2-aminobenzimidazoles: a novel class of neuroprotective agents targeting mGluR5. Bioorg Med Chem 23:2211-20 (2015)  
Target
Name:
Metabotropic glutamate receptor 5
Synonyms:
GRM5_MOUSE Grm5 | Mglur5
Type:
PROTEIN
Mol. Mass.:
131881.16
Organism:
Mus musculus
Description:
ChEMBL_103834
Residue:
1203
  
Inhibitor
Name:
BDBM50067179
Synonyms:
CHEMBL3401724
Type:
Small organic molecule
Emp. Form.:
C16H9F6N3O
Mol. Mass.:
373.2526
SMILES:
FC(F)(F)c1ccc(c(c1)C(=O)Nc1nc2ccccc2[nH]1)C(F)(F)F
: