Target
Metabotropic glutamate receptor 5
Ligand
BDBM50067173
Substrate
Meas. Tech.
ChEMBL_1463958 (CHEMBL3405792)
IC50
12000±n/a nM
Citation
 He, XLakkaraju, SKHanscom, MZhao, ZWu, JStoica, BMacKerell, ADFaden, AIXue, F Acyl-2-aminobenzimidazoles: a novel class of neuroprotective agents targeting mGluR5. Bioorg Med Chem 23:2211-20 (2015)  
Target
Name:
Metabotropic glutamate receptor 5
Synonyms:
GRM5_MOUSE Grm5 | Mglur5
Type:
PROTEIN
Mol. Mass.:
131881.16
Organism:
Mus musculus
Description:
ChEMBL_103834
Residue:
1203
  
Inhibitor
Name:
BDBM50067173
Synonyms:
CHEMBL3401720
Type:
Small organic molecule
Emp. Form.:
C15H10F3N3O
Mol. Mass.:
305.2546
SMILES:
FC(F)(F)c1cccc(c1)C(=O)Nc1nc2ccccc2[nH]1
: