Target
Ceramide transfer protein
Ligand
BDBM50067352
Substrate
Meas. Tech.
ChEMBL_1465154 (CHEMBL3405855)
EC50
22000±n/a nM
Citation
 Santos, CFleury, LRodriguez, FMarkus, JBerke?, DDaïch, AAusseil, FBaudoin-Dehoux, CBallereau, SGénisson, Y The CERT antagonist HPA-12: first practical synthesis and individual binding evaluation of the four stereoisomers. Bioorg Med Chem 23:2004-9 (2015)  
Target
Name:
Ceramide transfer protein
Synonyms:
CERT CERT1 COL4A3BP Collagen type IV alpha-3-binding protein Goodpasture antigen-binding protein START domain-containing protein 11 hCERT
Type:
PROTEIN
Mol. Mass.:
70818.45
Organism:
Homo sapiens (Human)
Description:
ChEMBL_109569
Residue:
624
  
Inhibitor
Name:
BDBM50067352
Synonyms:
CHEMBL122892
Type:
Small organic molecule
Emp. Form.:
C22H37NO3
Mol. Mass.:
363.5341
SMILES:
CCCCCCCCCCCC(=O)N[C@@H](CO)C[C@@H](O)c1ccccc1
: