Target
Induced myeloid leukemia cell differentiation protein Mcl-1
Ligand
BDBM50067458
Substrate
Meas. Tech.
ChEMBL_1465279 (CHEMBL3406498)
Ki
66±n/a nM
Citation
 Wan, YWu, SXiao, GLiu, THou, XChen, CGuan, PYang, XFang, H Design, synthesis and preliminary bioactivity studies of 2-thioxo-4-thiazolidinone derivatives as Bcl-2 inhibitors. Bioorg Med Chem 23:1994-2003 (2015)  
Target
Name:
Induced myeloid leukemia cell differentiation protein Mcl-1
Synonyms:
BCL2L3 Bcl-2-like protein 3 (Mcl-1) Bcl2-L-3 MCL1 Mcl-1 Myeloid cell leukemia sequence 1 (BCL2-related) | mcl1/EAT
Type:
Membrane; Single-pass membrane protein
Mol. Mass.:
37332.87
Organism:
Homo sapiens (Human)
Description:
Q07820
Residue:
350
  
Inhibitor
Name:
BDBM50067458
Synonyms:
CHEMBL3401801
Type:
Small organic molecule
Emp. Form.:
C31H22BrClN2O4S3
Mol. Mass.:
698.069
SMILES:
Clc1ccc(cc1)-c1ccc(\C=C2/SC(=S)N([C@@H](Cc3ccc(Br)cc3)C(=O)NS(=O)(=O)c3ccccc3)C2=O)cc1
: