Target
Lysine-specific histone demethylase 1A
Ligand
BDBM50113851
Substrate
Meas. Tech.
ChEMBL_1465838 (CHEMBL3406143)
IC50
>100000±n/a nM
Citation
 Kakizawa, TOta, YItoh, YTsumoto, HSuzuki, T Histone H3 peptide based LSD1-selective inhibitors. Bioorg Med Chem Lett 25:1925-8 (2015)  
Target
Name:
Lysine-specific histone demethylase 1A
Synonyms:
AOF2 Flavin-containing amine oxidase domain-containing protein 2 KDM1A KIAA0601 Lysine-specific demethylase 1 (LSD1) Lysine-specific histone demethylase 1 (LSD1)
Type:
Enzyme
Mol. Mass.:
92901.01
Organism:
Homo sapiens (Human)
Description:
O60341
Residue:
852
  
Inhibitor
Name:
BDBM50113851
Synonyms:
(+/-)-Tranylcypromine 2-Phenyl-cyclopropylamine CHEMBL313833 Tranylcypromine,(+) US8609708, 6 Tranyl- cypromine | US8609708, 6 Tranylcypromine
Type:
Small organic molecule
Emp. Form.:
C9H11N
Mol. Mass.:
133.1903
SMILES:
NC1CC1c1ccccc1
: