Target
Alkaline phosphatase, tissue-nonspecific isozyme
Ligand
BDBM50247721
Substrate
Meas. Tech.
ChEMBL_1464323 (CHEMBL3404590)
Ki
1250±n/a nM
Citation
 Al-Rashida, MEjaz, SAAli, SShaukat, AHamayoun, MAhmed, MIqbal, J Diarylsulfonamides and their bioisosteres as dual inhibitors of alkaline phosphatase and carbonic anhydrase: Structure activity relationship and molecular modelling studies. Bioorg Med Chem 23:2435-44 (2015)  
Target
Name:
Alkaline phosphatase, tissue-nonspecific isozyme
Synonyms:
ALPL Alkaline phosphatase liver/bone/kidney isozyme PPBT_BOVIN Tissue non-specific alkaline phosphatase (TNAP)
Type:
Protein
Mol. Mass.:
57195.60
Organism:
Bos taurus (Cattle)
Description:
P09487
Residue:
524
  
Inhibitor
Name:
BDBM50247721
Synonyms:
4-fluoro-N-(4-sulfamoylbenzyl)benzenesulfonamide | CHEMBL511186
Type:
Small organic molecule
Emp. Form.:
C13H13FN2O4S2
Mol. Mass.:
344.382
SMILES:
NS(=O)(=O)c1ccc(CNS(=O)(=O)c2ccc(F)cc2)cc1
: