Target
Interleukin-1 receptor-associated kinase 4
Ligand
BDBM50068409
Substrate
Meas. Tech.
ChEMBL_1466547 (CHEMBL3407004)
IC50
>20000±n/a nM
Citation
 McElroy, WTMichael Seganish, WJason Herr, RHarding, JYang, JYet, LKomanduri, VPrakash, KCLavey, BTulshian, DGreenlee, WJSondey, CFischmann, TONiu, X Discovery and hit-to-lead optimization of 2,6-diaminopyrimidine inhibitors of interleukin-1 receptor-associated kinase 4. Bioorg Med Chem Lett 25:1836-41 (2015)  
Target
Name:
Interleukin-1 receptor-associated kinase 4
Synonyms:
IRAK-4 IRAK4_HUMAN Interleukin-1 receptor-associated kinase 4 (IRAK4) | Renal carcinoma antigen NY-REN-64
Type:
Protein
Mol. Mass.:
51519.08
Organism:
Homo sapiens (Human)
Description:
Q9NWZ3
Residue:
460
  
Inhibitor
Name:
BDBM50068409
Synonyms:
CHEMBL3403428
Type:
Small organic molecule
Emp. Form.:
C18H21N5O4S
Mol. Mass.:
403.455
SMILES:
COc1nc(N)nc(N[C@@H]2C[C@H](CO)[C@@H](O)[C@H]2O)c1-c1nc2ccccc2s1
: