Target
Interleukin-1 receptor-associated kinase 4
Ligand
BDBM50068464
Substrate
Meas. Tech.
ChEMBL_1466547 (CHEMBL3407004)
IC50
1140±n/a nM
Citation
 McElroy, WTMichael Seganish, WJason Herr, RHarding, JYang, JYet, LKomanduri, VPrakash, KCLavey, BTulshian, DGreenlee, WJSondey, CFischmann, TONiu, X Discovery and hit-to-lead optimization of 2,6-diaminopyrimidine inhibitors of interleukin-1 receptor-associated kinase 4. Bioorg Med Chem Lett 25:1836-41 (2015)  
Target
Name:
Interleukin-1 receptor-associated kinase 4
Synonyms:
IRAK-4 IRAK4_HUMAN Interleukin-1 receptor-associated kinase 4 (IRAK4) | Renal carcinoma antigen NY-REN-64
Type:
Protein
Mol. Mass.:
51519.08
Organism:
Homo sapiens (Human)
Description:
Q9NWZ3
Residue:
460
  
Inhibitor
Name:
BDBM50068464
Synonyms:
CHEMBL3403442
Type:
Small organic molecule
Emp. Form.:
C17H20N6O3
Mol. Mass.:
356.3791
SMILES:
Nc1ncc(-c2cnc3ccccn23)c(N[C@@H]2C[C@H](CO)[C@@H](O)[C@H]2O)n1
: