Target
Interleukin-1 receptor-associated kinase 4
Ligand
BDBM50068476
Substrate
Meas. Tech.
ChEMBL_1466547 (CHEMBL3407004)
IC50
333000±n/a nM
Citation
 McElroy, WTMichael Seganish, WJason Herr, RHarding, JYang, JYet, LKomanduri, VPrakash, KCLavey, BTulshian, DGreenlee, WJSondey, CFischmann, TONiu, X Discovery and hit-to-lead optimization of 2,6-diaminopyrimidine inhibitors of interleukin-1 receptor-associated kinase 4. Bioorg Med Chem Lett 25:1836-41 (2015)  
Target
Name:
Interleukin-1 receptor-associated kinase 4
Synonyms:
IRAK-4 IRAK4_HUMAN Interleukin-1 receptor-associated kinase 4 (IRAK4) | Renal carcinoma antigen NY-REN-64
Type:
Protein
Mol. Mass.:
51519.08
Organism:
Homo sapiens (Human)
Description:
Q9NWZ3
Residue:
460
  
Inhibitor
Name:
BDBM50068476
Synonyms:
CHEMBL3403449 | US9598440, 15
Type:
Small organic molecule
Emp. Form.:
C21H25N5O3S
Mol. Mass.:
427.52
SMILES:
OC[C@H]1C[C@@H](Nc2nc(NCC3CC3)ncc2-c2nc3ccccc3s2)[C@H](O)[C@@H]1O
: