Target
Sodium- and chloride-dependent betaine transporter
Ligand
BDBM112777
Substrate
Meas. Tech.
ChEMBL_1466785 (CHEMBL3405541)
IC50
171000±n/a nM
Citation
 Vogensen, SBJørgensen, LMadsen, KKJurik, ABorkar, NRosatelli, ENielsen, BEcker, GFSchousboe, AClausen, RP Structure activity relationship of selective GABA uptake inhibitors. Bioorg Med Chem 23:2480-8 (2015)  
Target
Name:
Sodium- and chloride-dependent betaine transporter
Synonyms:
GABA transporter Gabt2 Gat2 Slc6a12
Type:
PROTEIN
Mol. Mass.:
69615.88
Organism:
Mus musculus
Description:
ChEMBL_1460088
Residue:
614
  
Inhibitor
Name:
BDBM112777
Synonyms:
NORTRIPTYLINE | US8629135, SW-02
Type:
Small organic molecule
Emp. Form.:
C19H21N
Mol. Mass.:
263.3767
SMILES:
[#6]-[#7]-[#6]-[#6]\[#6]=[#6]-1/c2ccccc2-[#6]-[#6]-c2ccccc-12
: