Target
Sodium- and chloride-dependent GABA transporter 3
Ligand
BDBM50069382
Substrate
Meas. Tech.
ChEMBL_1466787 (CHEMBL3405543)
IC50
870964±n/a nM
Citation
 Vogensen, SBJørgensen, LMadsen, KKJurik, ABorkar, NRosatelli, ENielsen, BEcker, GFSchousboe, AClausen, RP Structure activity relationship of selective GABA uptake inhibitors. Bioorg Med Chem 23:2480-8 (2015)  
Target
Name:
Sodium- and chloride-dependent GABA transporter 3
Synonyms:
GABA transporter Gabt3 Gat-4 Gat4 Slc6a11 Sodium- and chloride-dependent GABA transporter 4 | Solute carrier family 6 member 11
Type:
PROTEIN
Mol. Mass.:
69962.73
Organism:
Mus musculus
Description:
ChEMBL_1460090
Residue:
627
  
Inhibitor
Name:
BDBM50069382
Synonyms:
CHEMBL3403576
Type:
Small organic molecule
Emp. Form.:
C25H29F6NO2
Mol. Mass.:
489.4937
SMILES:
CN(CCOC(c1ccc(cc1)C(F)(F)F)c1ccc(cc1)C(F)(F)F)[C@@H]1CCCC[C@@H]1CO
: