Target
Sodium- and chloride-dependent GABA transporter 1
Ligand
BDBM50069382
Substrate
Meas. Tech.
ChEMBL_1466784 (CHEMBL3405540)
IC50
223000±n/a nM
Citation
 Vogensen, SBJørgensen, LMadsen, KKJurik, ABorkar, NRosatelli, ENielsen, BEcker, GFSchousboe, AClausen, RP Structure activity relationship of selective GABA uptake inhibitors. Bioorg Med Chem 23:2480-8 (2015)  
Target
Name:
Sodium- and chloride-dependent GABA transporter 1
Synonyms:
GABA transporter Gat-1 SC6A1_RAT Solute carrier family 6 member 1
Type:
PROTEIN
Mol. Mass.:
67006.26
Organism:
Rattus norvegicus
Description:
ChEMBL_1472611
Residue:
599
  
Inhibitor
Name:
BDBM50069382
Synonyms:
CHEMBL3403576
Type:
Small organic molecule
Emp. Form.:
C25H29F6NO2
Mol. Mass.:
489.4937
SMILES:
CN(CCOC(c1ccc(cc1)C(F)(F)F)c1ccc(cc1)C(F)(F)F)[C@@H]1CCCC[C@@H]1CO
: