Target
Amine oxidase [flavin-containing] B
Ligand
BDBM50069809
Substrate
Meas. Tech.
ChEMBL_1469746 (CHEMBL3413434)
IC50
273100±n/a nM
Citation
 Bautista-Aguilera, OMSamadi, AChioua, MNikolic, KFilipic, SAgbaba, DSoriano, Ede Andrés, LRodríguez-Franco, MIAlcaro, SRamsay, RROrtuso, FYañez, MMarco-Contelles, J N-Methyl-N-((1-methyl-5-(3-(1-(2-methylbenzyl)piperidin-4-yl)propoxy)-1H-indol-2-yl)methyl)prop-2-yn-1-amine, a new cholinesterase and monoamine oxidase dual inhibitor. J Med Chem 57:10455-63 (2014)  
Target
Name:
Amine oxidase [flavin-containing] B
Synonyms:
AOFB_HUMAN MAOB Monoamine oxidase type B (MAO B) Monoamine oxidase type B (MAOB)
Type:
Protein
Mol. Mass.:
58768.76
Organism:
Homo sapiens (Human)
Description:
P27338
Residue:
520
  
Inhibitor
Name:
BDBM50069809
Synonyms:
CHEMBL3407590
Type:
Small organic molecule
Emp. Form.:
C27H28N4O3
Mol. Mass.:
456.5362
SMILES:
CN(CC#C)Cc1cc2cc(OCc3ccc(OC(=O)N(C)C)c4ncccc34)ccc2n1C
: