Target
Cytochrome P450 3A4
Ligand
BDBM50069858
Substrate
Meas. Tech.
ChEMBL_1469958 (CHEMBL3414385)
IC50
>10000±n/a nM
Citation
 Tosh, DKFinley, APaoletta, SMoss, SMGao, ZGGizewski, ETAuchampach, JASalvemini, DJacobson, KA In vivo phenotypic screening for treating chronic neuropathic pain: modification of C2-arylethynyl group of conformationally constrained A3 adenosine receptor agonists. J Med Chem 57:9901-14 (2014)  
Target
Name:
Cytochrome P450 3A4
Synonyms:
Albendazole monooxygenase CP3A4_HUMAN CYP3A4 CYPIIIA4 Cytochrome P450 3A4 (CYP3A4) Nifedipine oxidase Taurochenodeoxycholate 6-alpha-hydroxylase
Type:
Enzyme
Mol. Mass.:
57349.57
Organism:
Homo sapiens (Human)
Description:
Residue:
503
  
Inhibitor
Name:
BDBM50069858
Synonyms:
CHEMBL3407774
Type:
Small organic molecule
Emp. Form.:
C20H20N8O3
Mol. Mass.:
420.4246
SMILES:
[H][C@]12C[C@]1([C@@H](O)[C@@H](O)[C@@H]2n1cnc2c(NC)nc(nc12)C#Cc1cnccn1)C(=O)NC
: