Target
Alpha-2A/Alpha-2B/Alpha-2C adrenergic receptor
Ligand
BDBM50070204
Substrate
Meas. Tech.
ChEMBL_1466991 (CHEMBL3411188)
Ki
562±n/a nM
Citation
 Kelly, BMcMullan, MMuguruza, COrtega, JEMeana, JJCallado, LFRozas, I a2-adrenoceptor antagonists: synthesis, pharmacological evaluation, and molecular modeling investigation of pyridinoguanidine, pyridino-2-aminoimidazoline and their derivatives. J Med Chem 58:963-77 (2015)  
Target
Name:
Alpha-2A/Alpha-2B/Alpha-2C adrenergic receptor
Synonyms:
Adrenergic Receptors (alpha 2) | Adrenergic receptor alpha-2
Type:
Mol. Mass.:
Description:
ASSAY_ID of ChEMBL is 305672
Components:
This complex has 3 components.
Component 1
Name:
Alpha-2B adrenergic receptor
Synonyms:
ADA2B_HUMAN ADRA2L1 Adrenergic alpha2B Adrenergic receptor alpha Alpha-2 adrenergic receptor subtype C2 Alpha-2B adrenoreceptor | Alpha-2BAR
Type:
Enzyme
Mol. Mass.:
49964.20
Organism:
Homo sapiens (Human)
Description:
P18089
Residue:
450
  
Component 2
Name:
Alpha-2A adrenergic receptor
Synonyms:
ADA2A_HUMAN ADRA2R Adrenergic alpha2A Alpha-2 adrenergic receptor subtype C10 Alpha-2A adrenoreceptor alpha-2A adrenergic receptor [Homo sapiens]
Type:
Enzyme
Mol. Mass.:
48979.91
Organism:
Homo sapiens (Human)
Description:
P08913
Residue:
450
  
Component 3
Name:
Alpha-2C adrenergic receptor
Synonyms:
ADA2C_HUMAN ADRA2L2 Adrenergic alpha2C Adrenergic receptor alpha Alpha-2 adrenergic receptor subtype C4 Alpha-2C adrenoreceptor | adrenergic, alpha-2C-, receptor [Homo sapiens]
Type:
Enzyme
Mol. Mass.:
49552.32
Organism:
Homo sapiens (Human)
Description:
P18825
Residue:
462
  
Inhibitor
Name:
BDBM50070204
Synonyms:
CHEMBL3407838
Type:
Small organic molecule
Emp. Form.:
C8H10Cl2N4
Mol. Mass.:
233.098
SMILES:
Cl.Clc1ccc(NC2=NCCN2)nc1
: