Target
Nischarin
Ligand
BDBM50070328
Substrate
Meas. Tech.
ChEMBL_1467221 (CHEMBL3411418)
Ki
83±n/a nM
Citation
 Gasparik, VGreney, HSchann, SFeldman, JFellmann, LEhrhardt, JDBousquet, P Synthesis and biological evaluation of 2-aryliminopyrrolidines as selective ligands for I1 imidazoline receptors: discovery of new sympatho-inhibitory hypotensive agents with potential beneficial effects in metabolic syndrome. J Med Chem 58:878-87 (2015)  
Target
Name:
Nischarin
Synonyms:
Imidazoline I1 Nisch | Nischarin
Type:
Enzyme Catalytic Domain
Mol. Mass.:
166460.59
Organism:
RAT
Description:
Q4G017
Residue:
1502
  
Inhibitor
Name:
BDBM50070328
Synonyms:
CHEBI:8862 | Rilmenidine
Type:
Small organic molecule
Emp. Form.:
C10H16N2O
Mol. Mass.:
180.2468
SMILES:
C1CC1C(NC1=NCCO1)C1CC1
: