Target
NAD-dependent protein deacetylase sirtuin-2
Ligand
BDBM50070604
Substrate
Meas. Tech.
ChEMBL_1467916 (CHEMBL3413120)
IC50
>100000±n/a nM
Citation
 Yang, TChen, XJin, HXSethi, GGo, ML Functionalized tetrahydro-1H-pyrido[4,3-b]indoles: a novel chemotype with Sirtuin 2 inhibitory activity. Eur J Med Chem 92:145-55 (2015)  
Target
Name:
NAD-dependent protein deacetylase sirtuin-2
Synonyms:
NAD-Dependent Deacetylase Sirtuin-2 NAD-dependent deacetylase sirtuin 3 SIR2-like SIR2L SIR2_HUMAN Sirtuin 2 (SIRT2)
Type:
Hydrolase
Mol. Mass.:
43172.62
Organism:
Homo sapiens (Human)
Description:
Residue:
389
  
Inhibitor
Name:
BDBM50070604
Synonyms:
CHEMBL3408984
Type:
Small organic molecule
Emp. Form.:
C19H23N5
Mol. Mass.:
321.4194
SMILES:
CCCCn1c2CCNCc2c2cc(ccc12)-c1cnc(N)nc1
: