Target
Protein arginine N-methyltransferase 5
Ligand
BDBM50070952
Substrate
Meas. Tech.
ChEMBL_1468799 (CHEMBL3411809)
IC50
8360±n/a nM
Citation
 Hu, HOwens, EASu, HYan, LLevitz, AZhao, XHenary, MZheng, YG Exploration of cyanine compounds as selective inhibitors of protein arginine methyltransferases: synthesis and biological evaluation. J Med Chem 58:1228-43 (2015)  
Target
Name:
Protein arginine N-methyltransferase 5
Synonyms:
72 kDa ICln-binding protein HRMT1L5 IBP72 Jak-binding protein 1 PRMT5/MEP50 complex Protein arginine methyltransferase 5 (PRMT5) SKB1 homolog Shk1 kinase-binding protein 1 homolog
Type:
Enzyme
Mol. Mass.:
72679.99
Organism:
Homo sapiens (Human)
Description:
O14744
Residue:
637
  
Inhibitor
Name:
BDBM50070952
Synonyms:
CHEMBL3409555
Type:
Small organic molecule
Emp. Form.:
C25H27Br2IN2S2
Mol. Mass.:
706.338
SMILES:
[I-].CCCCN1\C(Sc2ccc(Br)cc12)=C\C=C\c1sc2ccc(Br)cc2[n+]1CCCC
: