Target
Pantothenate kinase 3
Ligand
BDBM50071514
Substrate
Meas. Tech.
ChEMBL_1469804 (CHEMBL3413798)
EC50
1510±n/a nM
Citation
 Sharma, LKLeonardi, RLin, WBoyd, VAGoktug, AShelat, AAChen, TJackowski, SRock, CO A high-throughput screen reveals new small-molecule activators and inhibitors of pantothenate kinases. J Med Chem 58:1563-8 (2015)  
Target
Name:
Pantothenate kinase 3
Synonyms:
PANK3 Pantothenate kinase 3 hPanK3
Type:
PROTEIN
Mol. Mass.:
41093.59
Organism:
Homo sapiens (Human)
Description:
ChEMBL_109587
Residue:
370
  
Inhibitor
Name:
BDBM50071514
Synonyms:
CHEMBL3410241
Type:
Small organic molecule
Emp. Form.:
C19H17ClFN3OS
Mol. Mass.:
389.874
SMILES:
Fc1ccc(CC(=O)N2CCN(CC2)c2nc3c(Cl)cccc3s2)cc1
: