Target
Folate receptor alpha
Ligand
BDBM50072403
Substrate
Meas. Tech.
ChEMBL_1469596 (CHEMBL3412691)
IC50
49±n/a nM
Citation
 Wang, YMitchell-Ryan, SRaghavan, SGeorge, COrr, SHou, ZMatherly, LHGangjee, A Novel 5-substituted pyrrolo[2,3-d]pyrimidines as dual inhibitors of glycinamide ribonucleotide formyltransferase and 5-aminoimidazole-4-carboxamide ribonucleotide formyltransferase and as potential antitumor agents. J Med Chem 58:1479-93 (2015)  
Target
Name:
Folate receptor alpha
Synonyms:
Adult folate-binding protein FOLR FOLR1_HUMAN Folate receptor 1 KB cells FBP | Ovarian tumor-associated antigen MOv18
Type:
PROTEIN
Mol. Mass.:
29827.41
Organism:
Homo sapiens (Human)
Description:
ChEMBL_1469596
Residue:
257
  
Inhibitor
Name:
BDBM50072403
Synonyms:
CHEMBL3409335
Type:
Small organic molecule
Emp. Form.:
C20H23N5O6S
Mol. Mass.:
461.492
SMILES:
Nc1nc2[nH]cc(CCCCc3ccc(s3)C(=O)N[C@@H](CCC(O)=O)C(O)=O)c2c(=O)[nH]1
: