Target
Mitogen-activated protein kinase 1
Ligand
BDBM50072556
Substrate
Meas. Tech.
ChEMBL_1469629 (CHEMBL3412886)
Ki
0.400000±n/a nM
Citation
 Ren, LGrina, JMoreno, DBlake, JFGaudino, JJGarrey, RMetcalf, ATBurkard, MMartinson, MRasor, KChen, HDean, BGould, SEPacheco, PShahidi-Latham, SYin, JWest, KWang, WMoffat, JGSchwarz, JB Discovery of highly potent, selective, and efficacious small molecule inhibitors of ERK1/2. J Med Chem 58:1976-91 (2015)  
Target
Name:
Mitogen-activated protein kinase 1
Synonyms:
ERK2 Extracellular signal-regulated kinase 2 Extracellular signal-regulated kinase 2 (ERK2) MAPK 2 MK01_HUMAN Mitogen-activated protein kinase 1 (ERK-2) Mitogen-activated protein kinase 2 PRKM2 | p42-MAPK
Type:
Ser/Thr Protein Kinase
Mol. Mass.:
41392.76
Organism:
Homo sapiens (Human)
Description:
P28482
Residue:
360
  
Inhibitor
Name:
BDBM50072556
Synonyms:
CHEMBL3409407
Type:
Small organic molecule
Emp. Form.:
C21H21ClN4O2
Mol. Mass.:
396.87
SMILES:
Clc1cccc(Cn2ccc(cc2=O)-c2ccnc(NC3CCOCC3)n2)c1
: