Target
LIM domain kinase 1
Ligand
BDBM50072662
Substrate
Meas. Tech.
ChEMBL_1467101 (CHEMBL3411298)
IC50
18±n/a nM
Citation
 Yin, YZheng, KEid, NHoward, SJeong, JHYi, FGuo, JPark, CMBibian, MWu, WHernandez, PPark, HWu, YLuo, JLLoGrasso, PVFeng, Y Bis-aryl urea derivatives as potent and selective LIM kinase (Limk) inhibitors. J Med Chem 58:1846-61 (2015)  
Target
Name:
LIM domain kinase 1
Synonyms:
LIMK LIMK1 | LIMK1_HUMAN
Type:
Enzyme Catalytic Domain
Mol. Mass.:
72591.81
Organism:
Homo sapiens (Human)
Description:
gi_4505001
Residue:
647
  
Inhibitor
Name:
BDBM50072662
Synonyms:
CHEMBL3407526
Type:
Small organic molecule
Emp. Form.:
C24H23FN6O2
Mol. Mass.:
446.4768
SMILES:
CC(C)NC(=O)c1cccc(NC(=O)Nc2ccc(cc2F)-c2ncnc3[nH]cc(C)c23)c1
: