Target
Cholecystokinin receptor type A
Ligand
BDBM50072419
Substrate
Meas. Tech.
ChEMBL_1468530 (CHEMBL3413158)
IC50
233±n/a nM
Citation
 Desai, AJHenke, BRMiller, LJ Elimination of a cholecystokinin receptor agonist 'trigger' in an effort to develop positive allosteric modulators without intrinsic agonist activity. Bioorg Med Chem Lett 25:1849-55 (2015)  
Target
Name:
Cholecystokinin receptor type A
Synonyms:
CCK-A receptor CCK1-R CCKAR_HUMAN Cholecystokinin receptor Cholecystokinin-1 Receptor
Type:
G Protein-Coupled Receptor (GPCR)
Mol. Mass.:
47859.34
Organism:
Homo sapiens (Human)
Description:
Stable expression of human CCK-1 receptors in HEK 293 cells.
Residue:
428
  
Inhibitor
Name:
BDBM50072419
Synonyms:
2-[2,4-Dioxo-5-phenyl-3-(3-phenyl-ureido)-2,3,4,5-tetrahydro-benzo[b][1,4]diazepin-1-yl]-N-(4-methoxy-phenyl)-N-methyl-acetamide | CHEMBL105775
Type:
Small organic molecule
Emp. Form.:
C32H29N5O5
Mol. Mass.:
563.6032
SMILES:
COc1ccc(cc1)N(C)C(=O)CN1c2ccccc2N(c2ccccc2)C(=O)C(NC(=O)Nc2ccccc2)C1=O
: