Target
Prostaglandin G/H synthase 1
Ligand
BDBM50074905
Substrate
Meas. Tech.
ChEMBL_1468556 (CHEMBL3413346)
IC50
>100000±n/a nM
Citation
 Chen, ZWang, ZCYan, XQWang, PFLu, XYChen, LWZhu, HLZhang, HW Design, synthesis, biological evaluation and molecular modeling of dihydropyrazole sulfonamide derivatives as potential COX-1/COX-2 inhibitors. Bioorg Med Chem Lett 25:1947-51 (2015)  
Target
Name:
Prostaglandin G/H synthase 1
Synonyms:
COX-1 Cyclooxygenase Cyclooxygenase-1 (COX-1) PTGS1 | Prostaglandin G/H synthase (cyclooxygenase)
Type:
Enzyme
Mol. Mass.:
68692.62
Organism:
Homo sapiens (Human)
Description:
P23219
Residue:
599
  
Inhibitor
Name:
BDBM50074905
Synonyms:
CHEMBL3410347
Type:
Small organic molecule
Emp. Form.:
C23H20ClN3O2S
Mol. Mass.:
437.942
SMILES:
NS(=O)(=O)c1ccc(cc1)N1N=C2C(CCc3ccccc23)C1c1ccccc1Cl
: