Target
Prostaglandin G/H synthase 2
Ligand
BDBM50074905
Substrate
Meas. Tech.
ChEMBL_1468557 (CHEMBL3413347)
IC50
4920±n/a nM
Citation
 Chen, ZWang, ZCYan, XQWang, PFLu, XYChen, LWZhu, HLZhang, HW Design, synthesis, biological evaluation and molecular modeling of dihydropyrazole sulfonamide derivatives as potential COX-1/COX-2 inhibitors. Bioorg Med Chem Lett 25:1947-51 (2015)  
Target
Name:
Prostaglandin G/H synthase 2
Synonyms:
COX2 Cyclooxygenase 2 (COX-2) Cyclooxygenase-2 (COX-2 AA) Cyclooxygenase-2 (COX-2) PGH2_HUMAN PHS II Prostaglandin E synthase/G/H synthase 2 Prostaglandin-endoperoxide synthase 2
Type:
Enzyme
Mol. Mass.:
69003.89
Organism:
Homo sapiens (Human)
Description:
Recombinant Cox-2 provided by Cayman (Cayman Chemical Co.,Ann Arbor, MI).
Residue:
604
  
Inhibitor
Name:
BDBM50074905
Synonyms:
CHEMBL3410347
Type:
Small organic molecule
Emp. Form.:
C23H20ClN3O2S
Mol. Mass.:
437.942
SMILES:
NS(=O)(=O)c1ccc(cc1)N1N=C2C(CCc3ccccc23)C1c1ccccc1Cl
: