Target
Protein arginine N-methyltransferase 1 [11-371]
Ligand
BDBM50446401
Substrate
Meas. Tech.
ChEMBL_1473677 (CHEMBL3421463)
IC50
8800±n/a nM
Citation
 Kaniskan, HÜKonze, KDJin, J Selective inhibitors of protein methyltransferases. J Med Chem 58:1596-629 (2015)  
Target
Name:
Protein arginine N-methyltransferase 1 [11-371]
Synonyms:
ANM1_HUMAN HRMT1L2 PRMT1 Protein arginine methyltransferase 1 (PRMT1) | Protein-arginine N-methyltransferase 1
Type:
Protein
Mol. Mass.:
41506.52
Organism:
Homo sapiens (Human)
Description:
Q99873[11-371]
Residue:
361
  
Inhibitor
Name:
BDBM50446401
Synonyms:
CHEMBL3109656
Type:
Small organic molecule
Emp. Form.:
C21H14N2O9S2
Mol. Mass.:
502.475
SMILES:
Oc1cc(cc2cc(NC(=O)Nc3ccc4c(O)cc(cc4c3)S([O-])(=O)=O)ccc12)S([O-])(=O)=O
: