Target
Histone-lysine N-methyltransferase, H3 lysine-79 specific
Ligand
BDBM50075098
Substrate
Meas. Tech.
ChEMBL_1473658 (CHEMBL3421227)
Ki
0.080000±n/a nM
Citation
 Kaniskan, HÜKonze, KDJin, J Selective inhibitors of protein methyltransferases. J Med Chem 58:1596-629 (2015)  
Target
Name:
Histone-lysine N-methyltransferase, H3 lysine-79 specific
Synonyms:
2.1.1.43 DOT1-like protein (Dot1L) DOT1L_HUMAN Histone H3-K79 methyltransferase Histone Methyltransferase DOT1L KIAA1814 Lysine N-methyltransferase 4
Type:
Protein
Mol. Mass.:
184911.91
Organism:
Homo sapiens (Human)
Description:
Q8TEK3
Residue:
1537
  
Inhibitor
Name:
BDBM50075098
Synonyms:
CHEMBL3414626 US9446064, A2
Type:
Small organic molecule
Emp. Form.:
C30H42N8O3
Mol. Mass.:
562.7063
SMILES:
CC(C)N(C[C@H]1O[C@H]([C@H](O)[C@@H]1O)n1cnc2c(N)ncnc12)[C@@H]1C[C@H](CCc2nc3cc(ccc3[nH]2)C(C)(C)C)C1
: