Target
Histone-arginine methyltransferase CARM1
Ligand
BDBM50075101
Substrate
Meas. Tech.
ChEMBL_1473622 (CHEMBL3420961)
IC50
3000±n/a nM
Citation
 Kaniskan, HÜKonze, KDJin, J Selective inhibitors of protein methyltransferases. J Med Chem 58:1596-629 (2015)  
Target
Name:
Histone-arginine methyltransferase CARM1
Synonyms:
CARM1 Coactivator-associated arginine methyltransferase 1 PRMT4 Protein arginine methyltransferase 4 (PRMT4)
Type:
Protein
Mol. Mass.:
65855.47
Organism:
Homo sapiens (Human)
Description:
Q86X55
Residue:
608
  
Inhibitor
Name:
BDBM50075101
Synonyms:
CHEMBL3414624
Type:
Small organic molecule
Emp. Form.:
C18H29N7O5
Mol. Mass.:
423.4668
SMILES:
CCCN[C@@H](CC[C@H](N)C(O)=O)C[C@H]1O[C@H]([C@H](O)[C@@H]1O)n1cnc2c(N)ncnc12
: