Target
DNA (cytosine-5)-methyltransferase 1
Ligand
BDBM50070942
Substrate
Meas. Tech.
ChEMBL_1473706 (CHEMBL3418012)
IC50
500±n/a nM
Citation
 Erdmann, AHalby, LFahy, JArimondo, PB Targeting DNA methylation with small molecules: what's next? J Med Chem 58:2569-83 (2015)  
Target
Name:
DNA (cytosine-5)-methyltransferase 1
Synonyms:
AIM CXXC9 DNA (cytosine-5)-methyltransferase 1 isoform b DNA methyltransferase HsaI DNMT1 M.HsaI | MCMT
Type:
Enzyme
Mol. Mass.:
183184.85
Organism:
Homo sapiens (Human)
Description:
P26358
Residue:
1616
  
Inhibitor
Name:
BDBM50070942
Synonyms:
(-)-Epigallocatechin gallate (-)-epigallocatechin 3-gallate CHEMBL297453 Epigallocatechin 3-gallate cid_65064
Type:
Small organic molecule
Emp. Form.:
C22H18O11
Mol. Mass.:
458.3717
SMILES:
Oc1cc(O)c2C[C@@H](OC(=O)c3cc(O)c(O)c(O)c3)[C@H](Oc2c1)c1cc(O)c(O)c(O)c1
: