Target
Steroid 17-alpha-hydroxylase/17,20 lyase
Ligand
BDBM50435992
Substrate
Meas. Tech.
ChEMBL_1473766 (CHEMBL3418491)
IC50
50±n/a nM
Citation
 Njar, VCBrodie, AM Discovery and development of Galeterone (TOK-001 or VN/124-1) for the treatment of all stages of prostate cancer. J Med Chem 58:2077-87 (2015)  
Target
Name:
Steroid 17-alpha-hydroxylase/17,20 lyase
Synonyms:
CP17A_HUMAN CYP17A1 Cytochrome P450 17A1 Cytochrome P450 C17 (CYP17) Cytochrome P450-C17 P450-C17 Steroid 17-alpha-Monooxygenase (CYP17) Steroid 17-alpha-monooxygenase | cytochrome P450 monooxygenase 17 alpha hydroxylase/17,20-lyase (CYP17)
Type:
Enzyme
Mol. Mass.:
57382.42
Organism:
Homo sapiens (Human)
Description:
E.coli expressing human CYP17
Residue:
508
  
Inhibitor
Name:
BDBM50435992
Synonyms:
CHEMBL2392006
Type:
Small organic molecule
Emp. Form.:
C22H30N2O
Mol. Mass.:
338.4864
SMILES:
C[C@]12CC[C@H]3[C@@H](CC=C4C[C@@H](O)CC[C@]34C)[C@@H]1CC=C2n1ccnc1
: