Target
P2X purinoceptor 7
Ligand
BDBM50075454
Substrate
Meas. Tech.
ChEMBL_1473818 (CHEMBL3418717)
IC50
84±n/a nM
Citation
 Park, JHLee, GELee, SDHien, TTKim, SYang, JWCho, JHKo, HLim, SCKim, YGKang, KWKim, YC Discovery of novel 2,5-dioxoimidazolidine-based P2X(7) receptor antagonists as constrained analogues of KN62. J Med Chem 58:2114-34 (2015)  
Target
Name:
P2X purinoceptor 7
Synonyms:
ATP receptor P2RX7_HUMAN P2X purinoceptor 7 (P2X7) P2Z receptor | Purinergic receptor
Type:
Protein
Mol. Mass.:
68602.85
Organism:
Homo sapiens (Human)
Description:
Q99572
Residue:
595
  
Inhibitor
Name:
BDBM50075454
Synonyms:
CHEMBL3415330
Type:
Small organic molecule
Emp. Form.:
C36H40N4O6S
Mol. Mass.:
656.791
SMILES:
O=C(CC12CC3CC(CC(C3)C1)C2)N1CCC(CC1)N1C(Cc2ccc(OS(=O)(=O)c3cccc4cnccc34)cc2)C(=O)NC1=O
: