Target
P2X purinoceptor 7
Ligand
BDBM50087267
Substrate
Meas. Tech.
ChEMBL_1473820 (CHEMBL3418719)
IC50
143±n/a nM
Citation
 Park, JHLee, GELee, SDHien, TTKim, SYang, JWCho, JHKo, HLim, SCKim, YGKang, KWKim, YC Discovery of novel 2,5-dioxoimidazolidine-based P2X(7) receptor antagonists as constrained analogues of KN62. J Med Chem 58:2114-34 (2015)  
Target
Name:
P2X purinoceptor 7
Synonyms:
ATP receptor P2RX7_HUMAN P2X purinoceptor 7 (P2X7) P2Z receptor | Purinergic receptor
Type:
Protein
Mol. Mass.:
68602.85
Organism:
Homo sapiens (Human)
Description:
Q99572
Residue:
595
  
Inhibitor
Name:
BDBM50087267
Synonyms:
(1-(N,O-bis(1,5-isoquinolinesulfonyl)-N-methyl-L-tyrosyl)-4phenylpiperazine) 1-(N,O-bis(1,5-isoquinolinesulfonyl)-N-methyl-L-tyrosyl)-4-phenylpiperazine Isoquinoline-5-sulfonic acid 4-[(S)-2-[(isoquinoline-5-sulfonyl)-methyl-amino]-3-oxo-3-(4-phenyl-piperazin-1-yl)-propyl]-phenyl ester [(1-[N,O-bis(5-isoquinolinesulphonyl)-N-methyl-Ltyrosyl]-4-phenylpiperazine)
Type:
Small organic molecule
Emp. Form.:
C38H35N5O6S2
Mol. Mass.:
721.844
SMILES:
CN([C@@H](Cc1ccc(OS(=O)(=O)c2cccc3cnccc23)cc1)C(=O)N1CCN(CC1)c1ccccc1)S(=O)(=O)c1cccc2cnccc12
: