Target
Tyrosine-protein kinase JAK2
Ligand
BDBM50076185
Substrate
Meas. Tech.
ChEMBL_1473903 (CHEMBL3419154)
Kd
53±n/a nM
Citation
 Thoma, GSmith, ABvan Eis, MJVangrevelinghe, EBlanz, JAichholz, RLittlewood-Evans, ALee, CCLiu, HZerwes, HG Discovery and profiling of a selective and efficacious Syk inhibitor. J Med Chem 58:1950-63 (2015)  
Target
Name:
Tyrosine-protein kinase JAK2
Synonyms:
JAK-2 JAK2_HUMAN Janus kinase 2 (JAK2) | Janus kinase 2 (a protein tyrosine kinase)
Type:
Protein
Mol. Mass.:
130684.68
Organism:
Homo sapiens (Human)
Description:
O60674
Residue:
1132
  
Inhibitor
Name:
BDBM50076185
Synonyms:
CHEMBL3416026 | US9290481, 1.1
Type:
Small organic molecule
Emp. Form.:
C18H22N8O
Mol. Mass.:
366.4203
SMILES:
N[C@H]1CCCC[C@H]1Nc1nnc(C(N)=O)c(Nc2cccc3cc[nH]c23)n1
: