Target
Endoplasmic reticulum aminopeptidase 2
Ligand
BDBM50076970
Substrate
Meas. Tech.
ChEMBL_1473169 (CHEMBL3418221)
IC50
2500±n/a nM
Citation
 Papakyriakou, AZervoudi, ETsoukalidou, SMauvais, FXSfyroera, GMastellos, DCvan Endert, PTheodorakis, EAVourloumis, DStratikos, E 3,4-diaminobenzoic acid derivatives as inhibitors of the oxytocinase subfamily of M1 aminopeptidases with immune-regulating properties. J Med Chem 58:1524-43 (2015)  
Target
Name:
Endoplasmic reticulum aminopeptidase 2
Synonyms:
Aminopeptidase ERAP2_HUMAN | LRAP
Type:
PROTEIN
Mol. Mass.:
110463.90
Organism:
Homo sapiens (Human)
Description:
ChEMBL_1473169
Residue:
960
  
Inhibitor
Name:
BDBM50076970
Synonyms:
CHEMBL3416694
Type:
Small organic molecule
Emp. Form.:
C20H33N7O4
Mol. Mass.:
435.5205
SMILES:
CCCC[C@H](N)C(=O)Nc1cc(ccc1N)C(=O)N[C@@H](CCCNC(N)=N)C(=O)OC
: